No puedo instalar cocoapods. Estoy haciendo esto:

gem install cocoapods

Y obtengo todos estos errores:

Building native extensions.  This could take a while...
ERROR:  Error installing cocoapods:
    ERROR: Failed to build gem native extension.

    current directory: /usr/local/lib/ruby/gems/2.4.0/gems/json-1.8.3/ext/json/ext/generator
/usr/local/opt/ruby/bin/ruby -r ./siteconf20161228-19158-1ru87yt.rb extconf.rb
creating Makefile

current directory: /usr/local/lib/ruby/gems/2.4.0/gems/json-1.8.3/ext/json/ext/generator
make "DESTDIR=" clean

current directory: /usr/local/lib/ruby/gems/2.4.0/gems/json-1.8.3/ext/json/ext/generator
make "DESTDIR="
compiling generator.c
generator.c:861:25: error: use of undeclared identifier 'rb_cFixnum'
    } else if (klass == rb_cFixnum) {
                        ^
generator.c:863:25: error: use of undeclared identifier 'rb_cBignum'
    } else if (klass == rb_cBignum) {
                        ^
generator.c:975:5: warning: division by zero is undefined [-Wdivision-by-zero]
    rb_scan_args(argc, argv, "01", &opts);
    ^~~~~~~~~~~~~~~~~~~~~~~~~~~~~~~~~~~~~
/usr/local/Cellar/ruby/2.4.0/include/ruby-2.4.0/ruby/ruby.h:2143:9: note: expanded from macro 'rb_scan_args'
        rb_scan_args0(argc,argvp,fmt,\
        ^~~~~~~~~~~~~~~~~~~~~~~~~~~~~~
/usr/local/Cellar/ruby/2.4.0/include/ruby-2.4.0/ruby/ruby.h:2329:8: note: expanded from macro 'rb_scan_args0'
                     rb_scan_args_verify(fmt, varc), vars)
                     ^~~~~~~~~~~~~~~~~~~~~~~~~~~~~~
/usr/local/Cellar/ruby/2.4.0/include/ruby-2.4.0/ruby/ruby.h:2201:11: note: expanded from macro 'rb_scan_args_verify'
        verify = rb_scan_args_verify_count(fmt, varc); \
                 ^~~~~~~~~~~~~~~~~~~~~~~~~~~~~~~~~~~~
note: (skipping 4 expansions in backtrace; use -fmacro-backtrace-limit=0 to see all)
/usr/local/Cellar/ruby/2.4.0/include/ruby-2.4.0/ruby/ruby.h:2167:6: note: expanded from macro 'rb_scan_args_count_hash'
     rb_scan_args_count_block(fmt, ofs, varc, vari) : \
     ^~~~~~~~~~~~~~~~~~~~~~~~~~~~~~~~~~~~~~~~~~~~~~
/usr/local/Cellar/ruby/2.4.0/include/ruby-2.4.0/ruby/ruby.h:2162:6: note: expanded from macro 'rb_scan_args_count_block'
     rb_scan_args_count_end(fmt, ofs, varc, vari) : \
     ^~~~~~~~~~~~~~~~~~~~~~~~~~~~~~~~~~~~~~~~~~~~
/usr/local/Cellar/ruby/2.4.0/include/ruby-2.4.0/ruby/ruby.h:2158:12: note: expanded from macro 'rb_scan_args_count_end'
    ((vari)/(!fmt[ofs] || rb_scan_args_bad_format(fmt)))
           ^~~~~~~~~~~~~~~~~~~~~~~~~~~~~~~~~~~~~~~~~~~~
generator.c:975:5: warning: division by zero is undefined [-Wdivision-by-zero]
    rb_scan_args(argc, argv, "01", &opts);
    ^~~~~~~~~~~~~~~~~~~~~~~~~~~~~~~~~~~~~
/usr/local/Cellar/ruby/2.4.0/include/ruby-2.4.0/ruby/ruby.h:2143:9: note: expanded from macro 'rb_scan_args'
        rb_scan_args0(argc,argvp,fmt,\
        ^~~~~~~~~~~~~~~~~~~~~~~~~~~~~~
/usr/local/Cellar/ruby/2.4.0/include/ruby-2.4.0/ruby/ruby.h:2329:8: note: expanded from macro 'rb_scan_args0'
                     rb_scan_args_verify(fmt, varc), vars)
                     ^~~~~~~~~~~~~~~~~~~~~~~~~~~~~~
/usr/local/Cellar/ruby/2.4.0/include/ruby-2.4.0/ruby/ruby.h:2201:11: note: expanded from macro 'rb_scan_args_verify'
        verify = rb_scan_args_verify_count(fmt, varc); \
                 ^~~~~~~~~~~~~~~~~~~~~~~~~~~~~~~~~~~~
note: (skipping 4 expansions in backtrace; use -fmacro-backtrace-limit=0 to see all)
/usr/local/Cellar/ruby/2.4.0/include/ruby-2.4.0/ruby/ruby.h:2167:6: note: expanded from macro 'rb_scan_args_count_hash'
     rb_scan_args_count_block(fmt, ofs, varc, vari) : \
     ^~~~~~~~~~~~~~~~~~~~~~~~~~~~~~~~~~~~~~~~~~~~~~
/usr/local/Cellar/ruby/2.4.0/include/ruby-2.4.0/ruby/ruby.h:2163:6: note: expanded from macro 'rb_scan_args_count_block'
     rb_scan_args_count_end(fmt, ofs+1, varc, vari+1))
     ^~~~~~~~~~~~~~~~~~~~~~~~~~~~~~~~~~~~~~~~~~~~~~~~
/usr/local/Cellar/ruby/2.4.0/include/ruby-2.4.0/ruby/ruby.h:2158:12: note: expanded from macro 'rb_scan_args_count_end'
    ((vari)/(!fmt[ofs] || rb_scan_args_bad_format(fmt)))
           ^~~~~~~~~~~~~~~~~~~~~~~~~~~~~~~~~~~~~~~~~~~~
generator.c:975:5: warning: division by zero is undefined [-Wdivision-by-zero]
    rb_scan_args(argc, argv, "01", &opts);
    ^~~~~~~~~~~~~~~~~~~~~~~~~~~~~~~~~~~~~
/usr/local/Cellar/ruby/2.4.0/include/ruby-2.4.0/ruby/ruby.h:2143:9: note: expanded from macro 'rb_scan_args'
        rb_scan_args0(argc,argvp,fmt,\
        ^~~~~~~~~~~~~~~~~~~~~~~~~~~~~~
/usr/local/Cellar/ruby/2.4.0/include/ruby-2.4.0/ruby/ruby.h:2329:8: note: expanded from macro 'rb_scan_args0'
                     rb_scan_args_verify(fmt, varc), vars)
                     ^~~~~~~~~~~~~~~~~~~~~~~~~~~~~~
/usr/local/Cellar/ruby/2.4.0/include/ruby-2.4.0/ruby/ruby.h:2201:11: note: expanded from macro 'rb_scan_args_verify'
        verify = rb_scan_args_verify_count(fmt, varc); \
                 ^~~~~~~~~~~~~~~~~~~~~~~~~~~~~~~~~~~~
note: (skipping 4 expansions in backtrace; use -fmacro-backtrace-limit=0 to see all)
/usr/local/Cellar/ruby/2.4.0/include/ruby-2.4.0/ruby/ruby.h:2168:6: note: expanded from macro 'rb_scan_args_count_hash'
     rb_scan_args_count_block(fmt, ofs+1, varc, vari+1))
     ^~~~~~~~~~~~~~~~~~~~~~~~~~~~~~~~~~~~~~~~~~~~~~~~~~
/usr/local/Cellar/ruby/2.4.0/include/ruby-2.4.0/ruby/ruby.h:2162:6: note: expanded from macro 'rb_scan_args_count_block'
     rb_scan_args_count_end(fmt, ofs, varc, vari) : \
     ^~~~~~~~~~~~~~~~~~~~~~~~~~~~~~~~~~~~~~~~~~~~
/usr/local/Cellar/ruby/2.4.0/include/ruby-2.4.0/ruby/ruby.h:2158:12: note: expanded from macro 'rb_scan_args_count_end'
    ((vari)/(!fmt[ofs] || rb_scan_args_bad_format(fmt)))
           ^~~~~~~~~~~~~~~~~~~~~~~~~~~~~~~~~~~~~~~~~~~~
generator.c:975:5: warning: division by zero is undefined [-Wdivision-by-zero]
    rb_scan_args(argc, argv, "01", &opts);
    ^~~~~~~~~~~~~~~~~~~~~~~~~~~~~~~~~~~~~
/usr/local/Cellar/ruby/2.4.0/include/ruby-2.4.0/ruby/ruby.h:2143:9: note: expanded from macro 'rb_scan_args'
        rb_scan_args0(argc,argvp,fmt,\
        ^~~~~~~~~~~~~~~~~~~~~~~~~~~~~~
/usr/local/Cellar/ruby/2.4.0/include/ruby-2.4.0/ruby/ruby.h:2329:8: note: expanded from macro 'rb_scan_args0'
                     rb_scan_args_verify(fmt, varc), vars)
                     ^~~~~~~~~~~~~~~~~~~~~~~~~~~~~~
/usr/local/Cellar/ruby/2.4.0/include/ruby-2.4.0/ruby/ruby.h:2201:11: note: expanded from macro 'rb_scan_args_verify'
        verify = rb_scan_args_verify_count(fmt, varc); \
                 ^~~~~~~~~~~~~~~~~~~~~~~~~~~~~~~~~~~~
note: (skipping 4 expansions in backtrace; use -fmacro-backtrace-limit=0 to see all)
/usr/local/Cellar/ruby/2.4.0/include/ruby-2.4.0/ruby/ruby.h:2167:6: note: expanded from macro 'rb_scan_args_count_hash'
     rb_scan_args_count_block(fmt, ofs, varc, vari) : \
     ^~~~~~~~~~~~~~~~~~~~~~~~~~~~~~~~~~~~~~~~~~~~~~
/usr/local/Cellar/ruby/2.4.0/include/ruby-2.4.0/ruby/ruby.h:2162:6: note: expanded from macro 'rb_scan_args_count_block'
     rb_scan_args_count_end(fmt, ofs, varc, vari) : \
     ^~~~~~~~~~~~~~~~~~~~~~~~~~~~~~~~~~~~~~~~~~~~
/usr/local/Cellar/ruby/2.4.0/include/ruby-2.4.0/ruby/ruby.h:2158:12: note: expanded from macro 'rb_scan_args_count_end'
    ((vari)/(!fmt[ofs] || rb_scan_args_bad_format(fmt)))
           ^~~~~~~~~~~~~~~~~~~~~~~~~~~~~~~~~~~~~~~~~~~~
generator.c:975:5: warning: division by zero is undefined [-Wdivision-by-zero]
    rb_scan_args(argc, argv, "01", &opts);
    ^~~~~~~~~~~~~~~~~~~~~~~~~~~~~~~~~~~~~
/usr/local/Cellar/ruby/2.4.0/include/ruby-2.4.0/ruby/ruby.h:2143:9: note: expanded from macro 'rb_scan_args'
        rb_scan_args0(argc,argvp,fmt,\
        ^~~~~~~~~~~~~~~~~~~~~~~~~~~~~~
/usr/local/Cellar/ruby/2.4.0/include/ruby-2.4.0/ruby/ruby.h:2329:8: note: expanded from macro 'rb_scan_args0'
                     rb_scan_args_verify(fmt, varc), vars)
                     ^~~~~~~~~~~~~~~~~~~~~~~~~~~~~~
/usr/local/Cellar/ruby/2.4.0/include/ruby-2.4.0/ruby/ruby.h:2201:11: note: expanded from macro 'rb_scan_args_verify'
        verify = rb_scan_args_verify_count(fmt, varc); \
                 ^~~~~~~~~~~~~~~~~~~~~~~~~~~~~~~~~~~~
note: (skipping 4 expansions in backtrace; use -fmacro-backtrace-limit=0 to see all)
/usr/local/Cellar/ruby/2.4.0/include/ruby-2.4.0/ruby/ruby.h:2167:6: note: expanded from macro 'rb_scan_args_count_hash'
     rb_scan_args_count_block(fmt, ofs, varc, vari) : \
     ^~~~~~~~~~~~~~~~~~~~~~~~~~~~~~~~~~~~~~~~~~~~~~
/usr/local/Cellar/ruby/2.4.0/include/ruby-2.4.0/ruby/ruby.h:2162:6: note: expanded from macro 'rb_scan_args_count_block'
     rb_scan_args_count_end(fmt, ofs, varc, vari) : \
     ^~~~~~~~~~~~~~~~~~~~~~~~~~~~~~~~~~~~~~~~~~~~
/usr/local/Cellar/ruby/2.4.0/include/ruby-2.4.0/ruby/ruby.h:2158:12: note: expanded from macro 'rb_scan_args_count_end'
    ((vari)/(!fmt[ofs] || rb_scan_args_bad_format(fmt)))
           ^~~~~~~~~~~~~~~~~~~~~~~~~~~~~~~~~~~~~~~~~~~~
generator.c:975:5: warning: division by zero is undefined [-Wdivision-by-zero]
    rb_scan_args(argc, argv, "01", &opts);
    ^~~~~~~~~~~~~~~~~~~~~~~~~~~~~~~~~~~~~
/usr/local/Cellar/ruby/2.4.0/include/ruby-2.4.0/ruby/ruby.h:2143:9: note: expanded from macro 'rb_scan_args'
        rb_scan_args0(argc,argvp,fmt,\
        ^~~~~~~~~~~~~~~~~~~~~~~~~~~~~~
/usr/local/Cellar/ruby/2.4.0/include/ruby-2.4.0/ruby/ruby.h:2329:8: note: expanded from macro 'rb_scan_args0'
                     rb_scan_args_verify(fmt, varc), vars)
                     ^~~~~~~~~~~~~~~~~~~~~~~~~~~~~~
/usr/local/Cellar/ruby/2.4.0/include/ruby-2.4.0/ruby/ruby.h:2201:11: note: expanded from macro 'rb_scan_args_verify'
        verify = rb_scan_args_verify_count(fmt, varc); \
                 ^~~~~~~~~~~~~~~~~~~~~~~~~~~~~~~~~~~~
note: (skipping 5 expansions in backtrace; use -fmacro-backtrace-limit=0 to see all)
/usr/local/Cellar/ruby/2.4.0/include/ruby-2.4.0/ruby/ruby.h:2167:6: note: expanded from macro 'rb_scan_args_count_hash'
     rb_scan_args_count_block(fmt, ofs, varc, vari) : \
     ^~~~~~~~~~~~~~~~~~~~~~~~~~~~~~~~~~~~~~~~~~~~~~
/usr/local/Cellar/ruby/2.4.0/include/ruby-2.4.0/ruby/ruby.h:2162:6: note: expanded from macro 'rb_scan_args_count_block'
     rb_scan_args_count_end(fmt, ofs, varc, vari) : \
     ^~~~~~~~~~~~~~~~~~~~~~~~~~~~~~~~~~~~~~~~~~~~
/usr/local/Cellar/ruby/2.4.0/include/ruby-2.4.0/ruby/ruby.h:2158:12: note: expanded from macro 'rb_scan_args_count_end'
    ((vari)/(!fmt[ofs] || rb_scan_args_bad_format(fmt)))
           ^~~~~~~~~~~~~~~~~~~~~~~~~~~~~~~~~~~~~~~~~~~~
6 warnings and 2 errors generated.
make: *** [generator.o] Error 1

make failed, exit code 2

Gem files will remain installed in /usr/local/lib/ruby/gems/2.4.0/gems/json-1.8.3 for inspection.
Results logged to /usr/local/lib/ruby/gems/2.4.0/extensions/x86_64-darwin-16/2.4.0/json-1.8.3/gem_make.out

He estado buscando mucho y no puedo encontrar nada sobre esos errores.

¿Cómo puedo resolver eso?

5
pableiros 28 dic. 2016 a las 22:41

3 respuestas

La mejor respuesta

Parece que JSON 1.8.3 no es compatible con ruby 2.4. . Creo que lo están arreglando ahora. Mientras tanto, resolví un problema similar bajando a ruby 2.3

5
Deor 28 dic. 2016 a las 22:03

El mismo problema aquí con la gema 'github-pages', tratando de instalar json ..

Resolví mi problema bajando a ruby 2.3 usando esto:

`brew install rbenv ruby-build

Agregue rbenv a bash para que se cargue cada vez que abra un eco de terminal 'if which rbenv> / dev / null; luego evalúe "$ (rbenv init -)"; fi '>> ~ / .bash_profile source ~ / .bash_profile

Instalar Ruby rbenv instalar 2.3.3 rbenv global 2.3.3 ruby -v`

De: https://gorails.com/setup/osx/10.12-sierra

0
zoph 29 dic. 2016 a las 10:03

He tenido el mismo problema Instalé la aplicación Cocoapods desde su sitio, lo que me permitió construir los cocoapods que necesitaba para mi aplicación (integrando firebase).

https://github.com/CocoaPods/CocoaPods/issues/6299#issuecomment-269282062

La instalación de las herramientas de línea de comandos me pareció funcionar, pero espero que la dependencia rota (json1.8.3) se repare para que esto se compile correctamente.

Esperemos que esto lo ayude hasta que encuentre una solución más permanente.

0
Joe Spadafora 29 dic. 2016 a las 06:49